Fri Jun 23 02:13:29 2017

bin/pencil-test --clean --local --html --use-pc_auto-test --auto-test-options=--max-level=2,--no-pencil-check,--fast

Galileo:


/data/pencil-code-test/samples/no-modules: (1/53)
    Compiling..            [double]           ok        00:13
    Starting..                                ok        00:00
    Running..                                 ok        00:00
    Validating results..                      ok      
    Time used:                                        00:13 = 00:13 + 00:00

/data/pencil-code-test/samples/most-modules: (2/53)
    Compiling..                               ok        00:19
    Starting..                                ok        00:01
    Running..                                 ok        00:23
    Validating results..                      ok      
    Time used:                                        00:45 = 00:19 + 00:25

/data/pencil-code-test/samples/backwards-compatible: (3/53)
    Compiling..                               ok        00:17
    Starting..                                ok        00:00
    Running..                                 ok        00:00
    Validating results..                      ok      
    Time used:                                        00:17 = 00:17 + 00:00

/data/pencil-code-test/samples/1d-tests/implicit_diffusion: (4/53)
    Compiling..                               ok        00:14
    Starting..                                ok        00:00
    Running..                                 ok        00:00
    Validating results..                      ok      
    Time used:                                        00:15 = 00:14 + 00:00

/data/pencil-code-test/samples/2d-tests/chemistry_GrayScott: (5/53)
    Compiling..                               ok        00:13
    Starting..                                ok        00:00
    Running..                                 ok        00:10
    Validating results..                      ok      
    Time used:                                        00:23 = 00:13 + 00:10

/data/pencil-code-test/samples/2d-tests/boussinesq_convection: (6/53)
    Compiling..                               ok        00:14
    Starting..                                ok        00:00
    Running..                                 ok        00:01
    Validating results..                      ok      
    Time used:                                        00:16 = 00:14 + 00:01

/data/pencil-code-test/samples/2d-tests/selfgravitating-shearwave: (7/53)
    Compiling..                               ok        00:16
    Starting..                                ok        00:01
    Running..                                 ok        00:04
    Validating results..                      ok      
    Time used:                                        00:21 = 00:16 + 00:05

/data/pencil-code-test/samples/2d-tests/shearwave-dust-par: (8/53)
    Compiling..                               ok        00:16
    Starting..                                ok        00:01
    Running..                                 ok        00:13
    Validating results..                      ok      
    Time used:                                        00:31 = 00:16 + 00:15

/data/pencil-code-test/samples/0d-tests/heating_ionize: (9/53)
    Compiling..            [double]           ok        00:14
    Starting..                                ok        00:00
    Running..                                 not ok:   00:00
Found config file 
hostname = galileo
Non-MPI run
1 CPU
lparticles = 0
lpointmasses = 0
Subcommand: run
Revision: Last Changed Rev: 74633
Fri Jun 23 02:16:50 2017
Running 'env MODULE_PREFIX= MODULE_INFIX=_mp_ MODULE_SUFFIX=_ /usr/bin/time -p ./src/run.x'...
SVN: -------            v.         (                   ) $Id$
SVN: -------            v.         (                   ) $Id$               
SVN: -------            v.         (                   ) $Id$               
SVN: -------            v.         (                   ) $Id$
SVN: -------            v.         (                   ) $Id$
SVN: -------            v.         (                   ) $Id$
SVN: -------            v.         (                   ) $Id$
SVN: -------            v.         (                   ) $Id$
SVN: -------            v.         (                   ) $Id$
SVN: -------            v.         (                   ) $Id$
SVN: -------            v.         (                   ) $Id$
SVN: -------            v.         (                   ) $Id$
SVN: -------            v.         (                   ) $Id$
SVN: -------            v.         (                   ) $Id$
SVN: -------            v.         (                   ) $Id$
SVN: -------            v.         (                   ) $Id$
SVN: -------            v.         (                   ) $Id$
SVN: -------            v.         (                   ) $Id$
SVN: -------            v.         (                   ) $Id$
SVN: -------            v.         (                   ) $Id$
SVN: -------            v.         (                   ) $Id$
SVN: -------            v.         (                   ) $Id$
SVN: -------            v.         (                   ) $Id$
SVN: -------            v.         (                   ) $Id$
SVN: -------            v.         (                   ) $Id$
SVN: -------            v.         (                   ) $Id$
SVN: -------            v.         (                   ) $Id$
SVN: -------            v.         (                   ) $Id$
SVN: -------            v.         (                   ) $Id$
SVN: -------            v.         (                   ) $Id$
SVN: -------            v.         (                   ) $Id$
SVN: -------            v.         (                   ) $Id$
 The verbose level is ip=          14  (ldebug= F )
 This is a 0-D run
 nxgrid, nygrid, nzgrid=           1           1           1
 Lx, Ly, Lz=   1.00000000000000        6.28318530717959     
   6.28318530717959     
       Vbox=   1.00000000000000     
 setup_slices: slice_position = p
 setup_slices: ix,iy,iz,iz2 (video files) =  -1  -1  -1  -1
 units_general: unit_velocity=   100000.000000000     
 units_general: unit_density=  9.999999999999997E-007
 units_general: unit_length=   100000000.000000     
 units_general: unit_magnetic=   3.54490770181103     
 (x,y,z)(point)=  0.500000000000000       0.000000000000000E+000
  0.000000000000000E+000
 (x,y,z)(point2)=  0.500000000000000       0.000000000000000E+000
  0.000000000000000E+000
 initialize_eos: ENTER
 initialize_density: 0-D run, turned off continuity equation
 diffusion: nothing (i.e. no mass diffusion)
 initialize_hydro: 0-D run, turned off advection of velocity
 initialize_energy: 0-D run, turned off pressure gradient term
 initialize_energy: 0-D run, turned off advection of entropy
 initialize_energy: nheatc_max,iheatcond=           4 nothing                  
 nothing                  nothing                  nothing                  
 heat conduction: nothing
 pde: ENTER
SVN: -------            v.         (                   ) $Id$
 duu_dt: SOLVE
Bcs for         ux,  x: <       p>, y: <       p>,  z: <       p>
Bcs for         uy,  x: <       p>, y: <       p>,  z: <       p>
Bcs for         uz,  x: <       p>, y: <       p>,  z: <       p>
 duu_dt: Calculate maxima and rms values...
 dlnrho_dt: SOLVE
Bcs for      lnrho,  x: <       p>, y: <       p>,  z: <       p>
 denergy_dt: SOLVE denergy_dt
Bcs for         ss,  x: <       p>, y: <       p>,  z: <       p>
 denergy_dt: lnTT,cs2,cp1=   4.26749417030936       0.000000000000000E+000
  0.000000000000000E+000
 denergy_dt: max(advec_cs2) =  0.000000000000000E+000
 calc_heat_cool: lgravz, lgravr, lgravx, lspherical_coords= F F F F
 save_name: a,iname=  0.000000000000000E+000           2
 save_name: a,iname=   3.00000000000000                3
 save_name: a,iname=  0.000000000000000E+000           1
 
 ---it-------------t---------------------dt------------------ethm------------------TTm------------------yHm-------------------ssm-------------------rhom---------
forrtl: severe (66): output statement overflows record, unit -5, file Internal Formatted Write
Image              PC                Routine            Line        Source             
run.x              00000000009D571A  Unknown               Unknown  Unknown
run.x              00000000009D4216  Unknown               Unknown  Unknown
run.x              00000000009942B0  Unknown               Unknown  Unknown
run.x              00000000009301FE  Unknown               Unknown  Unknown
run.x              000000000092F73F  Unknown               Unknown  Unknown
run.x              0000000000973A73  Unknown               Unknown  Unknown
run.x              0000000000971D50  Unknown               Unknown  Unknown
run.x              00000000007164AA  Unknown               Unknown  Unknown
run.x              000000000090F56C  Unknown               Unknown  Unknown
run.x              000000000044F28C  Unknown               Unknown  Unknown
libc.so.6          00007F383012EDE5  Unknown               Unknown  Unknown
run.x              000000000044F189  Unknown               Unknown  Unknown
Command exited with non-zero status 66
real 0.13
user 0.12
sys 0.00
'env MODULE_PREFIX= MODULE_INFIX=_mp_ MODULE_SUFFIX=_ /usr/bin/time -p ./src/run.x' failed: 
Aborting. [' pc_run run --no-pencil-check' reported: ]

/data/pencil-code-test/samples/dust-vortex: (10/53)
    Compiling..                               ok        00:16
    Starting..                                ok        00:00
    Running..                                 ok        00:06
    Validating results..                      ok      
    Time used:                                        00:23 = 00:16 + 00:06

/data/pencil-code-test/samples/damped_alfven_waves: (11/53)
    Compiling..                               ok        00:16
    Starting..                                ok        00:01
    Running..                                 ok        01:08
    Validating results..                      ok      
    Time used:                                        01:25 = 00:16 + 01:09

/data/pencil-code-test/samples/2d-tests/streaming_instability: (12/53)
    Compiling..                               ok        00:17
    Starting..                                ok        00:01
    Running..                                 ok        00:33
    Validating results..                      ok      
    Time used:                                        00:52 = 00:17 + 00:35

/data/pencil-code-test/samples/0d-tests/heating_noionize: (13/53)
    Compiling..                               ok        00:14
    Starting..                                ok        00:00
    Running..                                 ok        00:00
    Validating results..                      ok      
    Time used:                                        00:14 = 00:14 + 00:00

/data/pencil-code-test/samples/1d-tests/H2_flamespeed: (14/53)
    Compiling..                               ok        00:14
    Starting..                                ok        00:00
    Running..                                 ok        00:02
    Validating results..                      ok      
    Time used:                                        00:17 = 00:14 + 00:02

/data/pencil-code-test/samples/chiral-diffusion: (15/53)
    Compiling..                               ok        00:13
    Starting..                                ok        00:00
    Running..                                 ok        00:00
    Validating results..                      ok      
    Time used:                                        00:13 = 00:13 + 00:00

/data/pencil-code-test/samples/cosmicray: (16/53)
    Compiling..                               ok        00:15
    Starting..                                ok        00:00
    Running..                                 ok        00:00
    Validating results..                      ok      
    Time used:                                        00:15 = 00:15 + 00:00

/data/pencil-code-test/samples/1d-tests/sod_10: (17/53)
    Compiling..                               ok        00:14
    Starting..                                ok        00:00
    Running..                                 ok        00:02
    Validating results..                      ok      
    Time used:                                        00:17 = 00:14 + 00:03

/data/pencil-code-test/samples/1d-tests/ambipolar_diffusion: (18/53)
    Compiling..                               ok        00:16
    Starting..                                ok        00:00
    Running..                                 ok        00:01
    Validating results..                      ok      
    Time used:                                        00:18 = 00:16 + 00:02

/data/pencil-code-test/samples/helical-MHDturb: (19/53)
    Compiling..                               ok        00:18
    Starting..                                ok        00:00
    Running..                                 ok        00:06
    Validating results..                      ok      
    Time used:                                        00:24 = 00:18 + 00:06

/data/pencil-code-test/samples/polymer/forced_3dturbulence: (20/53)
    Compiling..                               ok        00:15
    Starting..                                ok        00:00
    Running..                                 ok        00:35
    Validating results..                      ok      
    Time used:                                        00:50 = 00:15 + 00:35

/data/pencil-code-test/samples/testfield_z: (21/53)
    Compiling..                               ok        00:15
    Starting..                                ok        00:00
    Running..                                 ok        00:30
    Validating results..                      ok      
    Time used:                                        00:46 = 00:15 + 00:31

/data/pencil-code-test/samples/random_uu_particles: (22/53)
    Compiling..                               ok        00:16
    Starting..                                ok        00:00
    Running..                                 ok        00:27
    Validating results..                      ok      
    Time used:                                        00:44 = 00:16 + 00:27

/data/pencil-code-test/samples/1d-tests/solar-atmosphere-temperature: (23/53)
    Compiling..            [double]           ok        00:15
    Starting..                                ok        00:00
    Running..                                 ok        00:07
    Validating results..                      ok      
    Time used:                                        00:23 = 00:15 + 00:07

/data/pencil-code-test/samples/kin-dynamo: (24/53)
    Compiling..                               not ok:   00:11
Found config file 
Running make '-j' 'FFLAGS_DOUBLE=-r8' 'CFLAGS_DOUBLE=-DDOUBLE_PRECISION' 'LD_MPI=' 'CFLAGS_FFTW3=' 'FFLAGS_FFTW3=' 'LD_FFTW3=' 'CFLAGS_FFTW2=' 'FFLAGS_FFTW2=' 'LD_FFTW2=' 'FC=mpif90' 'F77=mpif77' 'FFLAGS=-implicitnone -O3 -vec-report0' 'FSTD_95=-std95' 'FSTD_2003=-std03' 'CC=mpicc' 'CFLAGS=-DFUNDERSC=1' 'AR=xiar' 'FFLAGS+=-O0' 'default_to_be'
MAKING src/Makefile.inc
precision-check: No such file src/.current-precision -- creating new one at ./src/scripts/precision-check line 36.
touch src/.build-history
echo boris"@"`hostname` "("`date`")" >> src/.build-history
( cd src && \
	  echo "===== " make FROM_PARENT=src/ -f Makefile.src code "====="; \
	  make FROM_PARENT=src/ -f Makefile.src default_to_be \
	)
=====  make FROM_PARENT=src/ -f Makefile.src code =====
make[1]: entrant dans le répertoire « /data/pencil-code-test/samples/kin-dynamo/src »
scripts/mkcparam -b noborder_profiles.f90 nochemistry.f90 nochiral.f90 nocosmicray.f90 nocosmicrayflux.f90 nodensity.f90 deriv_10th.f90 nodetonate.f90 nodustdensity.f90 nodustvelocity.f90 noentropy.f90 noeos.f90 nofixed_point.f90 noforcing.f90 nogravity.f90 nogpu.f90 grid.f90 noheatflux.f90 hydro_kinematic.f90 nohyperresi_strict.f90 nohypervisc_strict.f90 noimplicit_diffusion.f90 noimplicit_physics.f90 noinitial_condition.f90 nointerstellar.f90 nolorenz_gauge.f90 magnetic.f90 magnetic/nomeanfield.f90 magnetic/nomeanfield_demfdt.f90 noneutraldensity.f90 noneutralvelocity.f90 noNSCBC.f90 noopacity.f90 noparticles.f90 noparticles_adaptation.f90 noparticles_coagulation.f90 noparticles_collisions.f90 noparticles_map.f90 noparticles_density.f90  noparticles_mass.f90 noparticles_number.f90 noparticles_radius.f90 noparticles_potential.f90 noparticles_grad.f90 noparticles_selfgravity.f90 noparticles_sink.f90 noparticles_drag.f90 noparticles_spin.f90 noparticles_stalker.f90 noparticles_lyapunov.f90 noparticles_stirring.f90 noparticles_diagnos_dv.f90 noparticles_diagnos_state.f90 noparticles_temperature.f90 noparticles_adsorbed.f90 noparticles_surfspec.f90 noparticles_chemistry.f90 nopointmasses.f90 nopoisson.f90 nopolymer.f90 nopower_spectrum.f90 nopscalar.f90 noradiation.f90 noselfgravity.f90 noshear.f90 noshock.f90 nosignal_handling.f90 nosolid_cells.f90 nospecial.f90 nosupersat.f90 nostreamlines.f90  notestfield.f90 notestflow.f90 notestscalar.f90 noviscosity.f90 cparam.local -o cparam.inc.tmp
${PENCIL_HOME}/utils/pc_identify_revision --reset
make -f Makefile.src  start.o run.o combine_videofiles.o read_videofiles.o read_all_videofiles.o read_vectorfiles.o pre_and_post_processing/pc_collect.o pre_and_post_processing/pc_reduce.o pre_and_post_processing/pc_distribute.o pre_and_post_processing/pc_distribute_z.o pre_and_post_processing/pc_extract.o pre_and_post_processing/pc_configtest.o pre_and_post_processing/pc_tecplot.o pre_and_post_processing/pc_tecplot_solid.o start.x run.x combine_videofiles.x read_videofiles.x read_all_videofiles.x read_vectorfiles.x pre_and_post_processing/pc_collect.x pre_and_post_processing/pc_reduce.x pre_and_post_processing/pc_distribute.x pre_and_post_processing/pc_distribute_z.x pre_and_post_processing/pc_extract.x pre_and_post_processing/pc_configtest.x pre_and_post_processing/pc_tecplot.x pre_and_post_processing/pc_tecplot_solid.x
make[2]: entrant dans le répertoire « /data/pencil-code-test/samples/kin-dynamo/src »
mpif90 -implicitnone -O3 -vec-report0 -O0    -std95 -o cparam.o -c cparam.f90
mpicc -DFUNDERSC=1    -o syscalls_ansi.o -c syscalls_ansi.c
scripts/mkdummyinc -d file_io_common.f90 -s file_io_f95.f90 -o file_io_common.inc
scripts/mkdummyinc -d noinitial_condition.f90 -s noinitial_condition.f90 -o initial_condition_dummies.inc
impicc -DFUNDERSC=1    -o nogsl.o -c nogsl.c
fort: command line warning #10120: overriding '-O3' with '-O0'
cparam_pencils.inc(427): warning #5199: Too many continuation lines
   , 'hjparallel    ', 'hjperp        ', 'nu_ni1        ', 'gamma_A2      '  &
--^
mpif90 -implicitnone -O3 -vec-report0 -O0    -std95 -o cdata.o -c cdata.f90
ifort: command line warning #10120: overriding '-O3' with '-O0'
mpif90 -implicitnone -O3 -vec-report0 -O0    -std95 -o general.o -c general.f90
mpif90 -implicitnone -O3 -vec-report0 -O0    -std95 -o noweno_transport.o -c noweno_transport.f90
ifort: commanifdort: command line warning # 10120l: overriding '-O3' with '-O0'i
ne warning #10120: overriding '-O3' with '-O0'
mpif90 -implicitnone -O3 -vec-report0 -O0    -std95 -o syscalls.o -c syscalls.f90
mpif90 -implicitnone -O3 -vec-report0 -O0    -std95 -o noyinyang.o -c noyinyang.f90
mpif90 -implicitnone -O3 -vec-report0 -O0    -std95 -o nogpu.o -c nogpu.f90
iifort: command line warning #10120: overriding '-O3' with '-O0'
ifort: command line warning #10120: overriding '-O3' with '-O0'
fort: command line warning #10120: overriding '-O3' with '-O0'
mpif90 -implicitnone -O3 -vec-report0 -O0     -o nompicomm.o -c nompicomm.f90
ifort: command line warning #10120: overriding '-O3' with '-O0'
mpif90 -implicitnone -O3 -vec-report0 -O0    -std95 -o messages.o -c messages.f90
mpif90 -implicitnone -O3 -vec-report0 -O0    -std95 -o ghost_check.o -c ghost_check.f90
mpif90 -implicitnone -O3 -vec-report0 -O0    -std95 -o nosolid_cells_mpicomm.o -c nosolid_cells_mpicomm.f90
mpif90 -implicitnone -O3 -vec-report0 -O0    -std95 -o combine_videofiles.o -c combine_videofiles.f90
impif90 -implicitnone -O3 -vec-report0 -O0    -std95 -o read_videofiles.o -c read_videofiles.f90
ifort: command line warning #10120: overriding '-O3' with '-O0'
fort: command line warning #10120: mpif90 -implicitnone -O3 -vec-report0 -O0    -std95 -o read_all_videofiles.o -c read_all_videofiles.f90
overriding '-O3' with '-O0'
impif90 -implicitnone -O3 -vec-report0 -O0    -std95 -o read_vectorfiles.o -c read_vectorfiles.f90
fort: command line warning #10120: overriding '-O3' with '-O0'
ifort: command line warning #10120: overriding '-O3' with '-O0'
iifort: command line warning #10120: overriding '-O3' with '-O0'
fort: command line warning #10120: overriding '-O3' with '-O0'
ifort: command line warning #10120: overriding '-O3' with '-O0'
mpif90 combine_videofiles.o cparam.o cdata.o general.o syscalls.o syscalls_ansi.o nompicomm.o  -o combine_videofiles.x -ldl
mpif90 read_vectorfiles.o cparam.o cdata.o general.o syscalls.o syscalls_ansi.o nompicomm.o  -o read_vectorfiles.x -ldl
mpif90 read_videofiles.o cparam.o cdata.o general.o syscalls.o syscalls_ansi.o nompicomm.o  -o read_videofiles.x -ldl
mpif90 -implicitnone -O3 -vec-report0 -O0    -std95 -o deriv_10th.o -c deriv_10th.f90
mpif90 -implicitnone -O3 -vec-report0 -O0    -std95 -o farray.o -c farray.f90
mpif90 -implicitnone -O3 -vec-report0 -O0    -o file_io_f95.o -c file_io_f95.f90
mpif90 -implicitnone -O3 -vec-report0 -O0    -std95 -o noyinyang_mpi.o -c noyinyang_mpi.f90
ifortmpif90 -implicitnone -O3 -vec-report0 -O0    -std95 -o shared_variables.o -c shared_variables.f90
: command line warning #10120: overriding '-O3' with '-O0'
mpif90 -implicitnone -O3 -vec-report0 -O0    -std95 -o nohdf5_io.o -c nohdf5_io.f90
ifort: command line warning #10120: overriding '-O3' with '-O0'
mpif90 -implicitnone -O3 -vec-report0 -O0    -std95 -o debug_io_dist.o -c debug_io_dist.f90
iiifort: command line warning #10120: overriding '-O3' with '-O0'
fort: command line warning #10120: overriding '-O3' with '-O0'
mpif90 -implicitnone -O3 -vec-report0 -O0    -std95 -o noimplicit_diffusion.o -c noimplicit_diffusion.f90
fort: command line warning #10120: overriding '-O3' with '-O0'
ifort: command line warning #10120: overriding '-O3' with '-O0'
ifort: command line warning #10120: overriding '-O3' with '-O0'
ifort: command line warning #10120: overriding '-O3' with '-O0'
mpif90 read_all_videofiles.o cparam.o cdata.o general.o syscalls.o syscalls_ansi.o nompicomm.o  -o read_all_videofiles.x -ldl
mpif90 -implicitnone -O3 -vec-report0 -O0    -std95 -o sub.o -c sub.f90
ifort: command line warning #10120: overriding '-O3' with '-O0'
mpif90 -implicitnone -O3 -vec-report0 -O0    -std95 -o diagnostics.o -c diagnostics.f90
mpif90 -implicitnone -O3 -vec-report0 -O0    -std95 -o nofourier.o -c nofourier.f90
mpif90 -implicitnone -O3 -vec-report0 -O0    -std95 -o io_dist.o -c io_dist.f90
mpif90 -implicitnone -O3 -vec-report0 -O0    -std95 -o noshock.o -c noshock.f90
iifort: command line warning #10120: overriding '-O3' with '-O0'
fort: command line warning #10120: overriding '-O3' with '-O0'
mpif90 -implicitnone -O3 -vec-report0 -O0    -std95 -o nolorenz_gauge.o -c nolorenz_gauge.f90
ifort: command line warning #10120: overriding '-O3' with '-O0'
mpif90 -implicitnone -O3 -vec-report0 -O0    -std95 -o nodebug.o -c nodebug.f90
mpif90 -implicitnone -O3 -vec-report0 -O0    -std95 -o nostreamlines.o -c nostreamlines.f90
ifort: command line warning #10120: overriding '-O3' with '-O0'
ifort: command line warning #10120: overriding '-O3' with '-O0'
mpif90 -implicitnone -O3 -vec-report0 -O0    -std95 -o nosignal_handling.o -c nosignal_handling.f90
ifort: command line warning #10120: overriding '-O3' with '-O0'
ifort: command line warning #10120: overriding '-O3' with '-O0'
ifort: command line warning #10120: overriding '-O3' with '-O0'
mpif90 -implicitnone -O3 -vec-report0 -O0    -std95 -o nofixed_point.o -c nofixed_point.f90
ifort: command line warning #10120: overriding '-O3' with '-O0'
mpif90 -implicitnone -O3 -vec-report0 -O0    -std95 -o nopoisson.o -c nopoisson.f90
mpif90 -implicitnone -O3 -vec-report0 -O0    -std95 -o nohyperresi_strict.o -c nohyperresi_strict.f90
mpif90 -implicitnone -O3 -vec-report0 -O0    -std95 -o nohypervisc_strict.o -c nohypervisc_strict.f90
ifort: command line warning #10120: overriding '-O3' with '-O0'
mpif90 -implicitnone -O3 -vec-report0 -O0    -std95 -o noghostfold.o -c noghostfold.f90
ifort: command line warning #10120: overriding '-O3' with '-O0'
ifort: command line warning #10120: overriding '-O3' with '-O0'
ifort: command line warning #10120: overriding '-O3' with '-O0'
mpif90 -implicitnone -O3 -vec-report0 -O0    -std95 -o grid.o -c grid.f90
mpif90 -implicitnone -O3 -vec-report0 -O0    -std95 -o noborder_profiles.o -c noborder_profiles.f90
ifort: commaifnd line warning #10120: overriding '-O3' with '-O0'
ort: command line warning #10120: overriding '-O3' with '-O0'
mpif90 -implicitnone -O3 -vec-report0 -O0    -std95 -o nodensity_methods.o -c nodensity_methods.f90
mpif90 -implicitnone -O3 -vec-report0 -O0    -std95 -o nogravity.o -c nogravity.f90
mpif90 -implicitnone -O3 -vec-report0 -O0    -std95 -o noinitial_condition.o -c noinitial_condition.f90
mpif90 -implicitnone -O3 -vec-report0 -O0    -std95 -o nospecial.o -c nospecial.f90
mpif90 -implicitnone -O3 -vec-report0 -O0    -std95 -o noparticles_main.o -c noparticles_main.f90
ifort: command line warning #10120: overriding '-O3' with '-O0'
mpif90 -implicitnone -O3 -vec-report0 -O0    -std95 -o noshear.o -c noshear.f90
iiifort: command line warning #10120: overriding '-O3' with '-O0'
fort: command line warning #10120: overriding '-O3' with '-O0'
mpif90 -implicitnone -O3 -vec-report0 -O0    -std95 -o noopacity.o -c noopacity.f90
fort: command line warning #10120: overriding '-O3' with '-O0'
mpif90 -implicitnone -O3 -vec-report0 -O0    -std95 -o nopower_spectrum.o -c nopower_spectrum.f90
mpif90 -implicitnone -O3 -vec-report0 -O0    -std95 -o nostruct_func.o -c nostruct_func.f90
ifort: command line warning #10120: overriding '-O3' with '-O0'
mpif90 -implicitnone -O3 -vec-report0 -O0    -std95 -o notimeavg.o -c notimeavg.f90
iifort: command line warning #10120: overriding '-O3' with '-O0'
ifort: command line warning #10120: overriding '-O3' with '-O0'
fort: command line warning #10120: overriding '-O3' with '-O0'
ifort: command line warning #10120: overriding '-O3' with '-O0'
ifort: command line warning #10120: overriding '-O3' with '-O0'
mpif90 -implicitnone -O3 -vec-report0 -O0    -std95 -o noeos.o -c noeos.f90
ifort: command line warning #10120: overriding '-O3' with '-O0'
mpif90 -implicitnone -O3 -vec-report0 -O0    -std95 -o magnetic/nomeanfield_demfdt.o -c magnetic/nomeanfield_demfdt.f90
mpif90 -implicitnone -O3 -vec-report0 -O0    -std95 -o nopointmasses.o -c nopointmasses.f90
ifort: command line warning #10120: overriding '-O3' with '-O0'
xiar r noparticles_main.a noparticles_main.o
ifort: command line warning #10120: overriding '-O3' with '-O0'
xiar: executing 'ar'
ar: création de noparticles_main.a
mpif90 -implicitnone -O3 -vec-report0 -O0    -std95 -o magnetic/nomeanfield.o -c magnetic/nomeanfield.f90
ifort: command line warning #10120: overriding '-O3' with '-O0'
mpif90 -implicitnone -O3 -vec-report0 -O0    -std95 -o initcond.o -c initcond.f90
mpif90 -implicitnone -O3 -vec-report0 -O0    -std95 -o nointerstellar.o -c nointerstellar.f90
mpif90 -implicitnone -O3 -vec-report0 -O0    -std95 -o boundcond.o -c boundcond.f90
mpif90 -implicitnone -O3 -vec-report0 -O0    -std95 -o noheatflux.o -c noheatflux.f90
mpif90 -implicitnone -O3 -vec-report0 -O0    -std95 -o noselfgravity.o -c noselfgravity.f90
iifort: command line warning #10120: overriding '-O3' with '-O0'
fort: command line warning #10120: overriding '-O3' with '-O0'
ifort: command line warning #10120: overriding '-O3' with '-O0'
ifort: command line warning #10120: overriding '-O3' with '-O0'
ifort: command line warning #10120: overriding '-O3' with '-O0'
boundcond.f90(887): warning #5268: Extension to standard: The text exceeds right hand column allowed on the line.
                ! BCZ_DOC: special for perfect conductor with const alpha and etaT when A considered as B; one-sided for 1st and 2nd derivative in two first inner points
------------------------------------------------------------------------------------------------------------------------------------^
mpif90 -implicitnone -O3 -vec-report0 -O0    -std95 -o nochemistry.o -c nochemistry.f90
mpif90 -implicitnone -O3 -vec-report0 -O0    -std95 -o nochiral.o -c nochiral.f90
mpif90 -implicitnone -O3 -vec-report0 -O0    -std95 -o nocosmicray.o -c nocosmicray.f90
mpif90 -implicitnone -O3 -vec-report0 -O0    -std95 -o nopscalar.o -c nopscalar.f90
ifort: command line warning #10120: overriding '-O3' with '-O0'
iifort: command line warning #10120: overriding '-O3' with '-O0'
fort: command line warning #10120: overriding '-O3' with '-O0'
mpif90 -implicitnone -O3 -vec-report0 -O0    -std95 -o noradiation.o -c noradiation.f90
mpif90 -implicitnone -O3 -vec-report0 -O0    -std95 -o noneutraldensity.o -c noneutraldensity.f90
mpif90 -implicitnone -O3 -vec-report0 -O0    -std95 -o nopolymer.o -c nopolymer.f90
mpif90 -implicitnone -O3 -vec-report0 -O0    -std95 -o nosupersat.o -c nosupersat.f90
ifort: command line warning #10120: overriding '-O3' with '-O0'
iifort: command line warning #10120: overriding '-O3' with '-O0'
fort: command line warning #10120: overriding '-O3' with '-O0'
ifort: command line warning #10120: overriding '-O3' with '-O0'
ifort: command line warning #10120: overriding '-O3' with '-O0'
mpif90 -implicitnone -O3 -vec-report0 -O0    -std95 -o noneutralvelocity.o -c noneutralvelocity.f90
mpif90 -implicitnone -O3 -vec-report0 -O0    -std95 -o nodustvelocity.o -c nodustvelocity.f90
mpif90 -implicitnone -O3 -vec-report0 -O0    -std95 -o nolsode_for_chemistry.o -c nolsode_for_chemistry.f90
ifort: command line warning #10120: overriding '-O3' with '-O0'
ifort: command line warning #10120: overriding '-O3' with '-O0'ifort: command line warning #
10120: overriding '-O3' with '-O0'
mpif90 -implicitnone -O3 -vec-report0 -O0    -std95 -o nodustdensity.o -c nodustdensity.f90
ifort: command line warning #10120: overriding '-O3' with '-O0'
mpif90 -implicitnone -O3 -vec-report0 -O0    -std95 -o nodensity.o -c nodensity.f90
mpif90 -implicitnone -O3 -vec-report0 -O0    -std95 -o noviscosity.o -c noviscosity.f90
mpif90 -implicitnone -O3 -vec-report0 -O0    -std95 -o noimplicit_physics.o -c noimplicit_physics.f90
mpif90 -implicitnone -O3 -vec-report0 -O0    -std95 -o nodetonate.o -c nodetonate.f90
mpif90 -implicitnone -O3 -vec-report0 -O0    -std95 -o filter.o -c filter.f90
iifort: command line warning #10120: overriding '-O3' with '-O0'
ifort: command line warning #10120: overriding '-O3' with '-O0'
iifort: command line warning #10120: overriding '-O3' with '-O0'
fort: command line warning #10120: overriding '-O3' with '-O0'
fort: command line warning #10120: overriding '-O3' with '-O0'
mpif90 -implicitnone -O3 -vec-report0 -O0    -std95 -o noforcing.o -c noforcing.f90
mpif90 -implicitnone -O3 -vec-report0 -O0    -std95 -o noNSCBC.o -c noNSCBC.f90
ifort: command line warning #10120: overriding '-O3' with '-O0'
ifort: command line warning #10120: overriding '-O3' with '-O0'
mpif90 -implicitnone -O3 -vec-report0 -O0    -std95 -o noentropy.o -c noentropy.f90
ifort: command line warning #10120: overriding '-O3' with '-O0'
mpif90 -implicitnone -O3 -vec-report0 -O0    -std95 -o magnetic.o -c magnetic.f90
ifort: command line warning #10120: overriding '-O3' with '-O0'
mpif90 -implicitnone -O3 -vec-report0 -O0    -std95 -o nosolid_cells.o -c nosolid_cells.f90
ifort: command line warning #10120: overriding '-O3' with '-O0'
mpif90 -implicitnone -O3 -vec-report0 -O0    -std95 -o hydro_kinematic.o -c hydro_kinematic.f90
xiar r magnetic.a magnetic.o magnetic/nomeanfield.o magnetic/nomeanfield_demfdt.o
ifort: command line warning #10120: overriding '-O3' with '-O0'
xiar: executing 'ar'
ar: création de magnetic.a
hydro.h(23): error #6404: This name does not have a type, and must have an explicit type.   [PUSH2C]
  public :: push2c
------------^
compilation aborted for hydro_kinematic.f90 (code 1)
make[2]: *** [hydro_kinematic.o] Erreur 1
make[2]: quittant le répertoire « /data/pencil-code-test/samples/kin-dynamo/src »
make[1]: *** [code] Erreur 2
make[1]: quittant le répertoire « /data/pencil-code-test/samples/kin-dynamo/src »
make: *** [default_to_be] Erreur 2
'make -j FFLAGS_DOUBLE=-r8 CFLAGS_DOUBLE=-DDOUBLE_PRECISION LD_MPI= CFLAGS_FFTW3= FFLAGS_FFTW3= LD_FFTW3= CFLAGS_FFTW2= FFLAGS_FFTW2= LD_FFTW2= FC=mpif90 F77=mpif77 FFLAGS=-implicitnone -O3 -vec-report0 FSTD_95=-std95 FSTD_2003=-std03 CC=mpicc CFLAGS=-DFUNDERSC=1 AR=xiar FFLAGS+=-O0 default_to_be' failed: <> [' pc_build  FFLAGS+=-O0' reported: ]

/data/pencil-code-test/samples/meissner: (25/53)
    Compiling..            [double]           ok        00:16
    Starting..                                ok        00:00
    Running..                                 ok        00:43
    Validating results..                      ok      
    Time used:                                        01:00 = 00:16 + 00:43

/data/pencil-code-test/samples/conv-slab-noequi: (26/53)
    Compiling..                               ok        00:14
    Starting..                                ok        00:00
    Running..                                 ok        00:16
    Validating results..                      ok      
    Time used:                                        00:31 = 00:14 + 00:16

/data/pencil-code-test/samples/conv-slab: (27/53)
    Compiling..            [double]           ok        00:15
    Starting..                                ok        00:01
    Running..                                 ok        00:10
    Validating results..                      ok      
    Time used:                                        00:27 = 00:15 + 00:11

/data/pencil-code-test/samples/corona: (28/53)
    Compiling..                               ok        00:19
    Starting..                                ok        00:01
    Running..                                 ok        01:56
    Validating results..                      ok      
    Time used:                                        02:17 = 00:19 + 01:58

/data/pencil-code-test/samples/2d-tests/globaldisc: (29/53)
    Compiling..                               ok        00:15
    Starting..                                ok        00:00
    Running..                                 ok        01:01
    Validating results..                      ok      
    Time used:                                        01:18 = 00:15 + 01:02

/data/pencil-code-test/samples/2d-tests/cylindrical_gdisk: (30/53)
    Compiling..                               ok        00:15
    Starting..                                ok        00:00
    Running..                                 ok        00:00
    Validating results..                      ok      
    Time used:                                        00:16 = 00:15 + 00:00

/data/pencil-code-test/samples/spherical-globaldisk: (31/53)
    Compiling..                               ok        00:15
    Starting..                                ok        00:01
    Running..                                 ok        00:01
    Validating results..                      ok      
    Time used:                                        00:18 = 00:15 + 00:02

/data/pencil-code-test/samples/spherical-globaldisk-mhd: (32/53)
    Compiling..                               ok        00:17
    Starting..                                ok        00:01
    Running..                                 ok        00:04
    Validating results..                      ok      
    Time used:                                        00:23 = 00:17 + 00:06

/data/pencil-code-test/samples/spherical-gdisk-planet-thermo: (33/53)
    Compiling..                               ok        00:17
    Starting..                                ok        00:01
    Running..                                 ok        00:31
    Validating results..                      ok      
    Time used:                                        00:50 = 00:17 + 00:32

/data/pencil-code-test/samples/0d-tests/solar_system: (34/53)
    Compiling..                               ok        00:13
    Starting..                                ok        00:01
    Running..                                 ok        00:01
    Validating results..                      ok      
    Time used:                                        00:16 = 00:13 + 00:02

/data/pencil-code-test/samples/mdwarf: (35/53)
    Compiling..                               ok        00:16
    Starting..                                ok        00:00
    Running..                                 ok        00:27
    Validating results..                      ok      
    Time used:                                        00:44 = 00:16 + 00:27

/data/pencil-code-test/samples/sedimentation: (36/53)
    Compiling..                               ok        00:17
    Starting..                                ok        00:01
    Running..                                 ok        00:08
    Validating results..                      ok      
    Time used:                                        00:28 = 00:17 + 00:10

/data/pencil-code-test/samples/MRI-turbulence_hyper: (37/53)
    Compiling..            [double]           ok        00:17
    Starting..                                ok        00:01
    Running..                                 ok        00:46
    Validating results..                      ok      
    Time used:                                        01:04 = 00:17 + 00:47

/data/pencil-code-test/samples/dust_turb_globaldisk: (38/53)
    Compiling..                               ok        00:19
    Starting..                                ok        00:01
    Running..                                 ok        00:09
    Validating results..                      ok      
    Time used:                                        00:29 = 00:19 + 00:10

/data/pencil-code-test/samples/geodynamo: (39/53)
    Compiling..                               ok        00:17
    Starting..                                ok        00:01
    Running..                                 ok        00:26
    Validating results..                      ok      
    Time used:                                        00:45 = 00:17 + 00:28

/data/pencil-code-test/samples/2d-tests/cylinder_deposition: (40/53)
    Compiling..                               ok        00:16
    Starting..                                ok        00:00
    Running..                                 ok        00:22
    Validating results..                      ok      
    Time used:                                        00:38 = 00:16 + 00:22

/data/pencil-code-test/samples/2d-tests/selfgravdisk-deadzone-dust: (41/53)
    Compiling..                               ok        00:18
    Starting..                                ok        00:01
    Running..                                 ok        00:03
    Validating results..                      ok      
    Time used:                                        00:23 = 00:18 + 00:04

/data/pencil-code-test/samples/2d-tests/spherical_viscous_ring: (42/53)
    Compiling..                               ok        00:16
    Starting..                                ok        00:00
    Running..                                 ok        00:08
    Validating results..                      ok      
    Time used:                                        00:24 = 00:16 + 00:08

/data/pencil-code-test/samples/2d-tests/field-loop-fargo: (43/53)
    Compiling..                               ok        00:17
    Starting..                                ok        00:01
    Running..                                 ok        00:02
    Validating results..                      ok      
    Time used:                                        00:21 = 00:17 + 00:03

/data/pencil-code-test/samples/baroclinic: (44/53)
    Compiling..                               ok        00:17
    Starting..                                ok        00:01
    Running..                                 ok        00:27
    Validating results..                      ok      
    Time used:                                        00:46 = 00:17 + 00:29

/data/pencil-code-test/samples/1d-tests/sedimentation-noneq-blocks: (45/53)
    Compiling..                               ok        00:17
    Starting..                                ok        00:01
    Running..                                 ok        00:01
    Validating results..                      ok      
    Time used:                                        00:19 = 00:17 + 00:02

/data/pencil-code-test/samples/1d-tests/alphadisk: (46/53)
    Compiling..                               ok        00:14
    Starting..                                ok        00:01
    Running..                                 ok        00:01
    Validating results..                      ok      
    Time used:                                        00:18 = 00:14 + 00:03

/data/pencil-code-test/samples/implicit_resistivity: (47/53)
    Compiling..                               ok        00:15
    Starting..                                ok        00:00
    Running..                                 ok        00:18
    Validating results..                      ok      
    Time used:                                        00:34 = 00:15 + 00:19

/data/pencil-code-test/samples/debris-photoelectric-fluid: (48/53)
    Compiling..                               ok        00:16
    Starting..                                ok        00:00
    Running..                                 ok        00:06
    Validating results..                     
----------------------------------------------------------------------
### auto-test failed ###
Failed 2 test(s) out of 53:
CPU time (including compilation):   31:39u 06:05s
Total wall-clock time:              26:25 = 12:40 + 13:31

----------------------------------------------------------------------
The following configuration has been used:
$config = {
            'environment' => {
                               'MODULE_SUFFIX' => '_',
                               'MODULE_INFIX' => '_mp_',
                               'MODULE_PREFIX' => ''
                             },
            'makefile' => {
                            'FSTD_2003' => '-std03',
                            'FSTD_95' => '-std95',
                            'CC' => 'mpicc',
                            'FC' => 'mpif90',
                            'FFLAGS' => '-implicitnone -O3 -vec-report0',
                            'MAKE_VAR1' => '-j',
                            'FFLAGS_DOUBLE' => '-r8',
                            'LD_FFTW3' => '',
                            'FFLAGS_FFTW3' => '',
                            'CFLAGS_DOUBLE' => '-DDOUBLE_PRECISION',
                            'CFLAGS_FFTW2' => '',
                            'FFLAGS_FFTW2' => '',
                            'AR' => 'xiar',
                            'CFLAGS_FFTW3' => '',
                            'CFLAGS' => '-DFUNDERSC=1',
                            'LD_FFTW2' => '',
                            'LD_MPI' => '',
                            'F77' => 'mpif77'
                          },
            'runtime' => {
                           'mpiexec_opts2' => '',
                           'mpiexec' => 'orterun',
                           'mpiexec_opts' => ''
                         }
          };
Perl version v5.14.2
Fri Jun 23 02:39:56 2017